id,login,email,fname,lname,company_id,phone,status,role,create_timestamp,locale_id,uid,gid,home_directory,valid_shell,is_api_login,timezone,office_location,enable_web_login,pending_job_count,bad_logins,last_ts
35,cvs-support,cvs-support@pwdata.jp,CVS,Support,5881,"",1,1,2009-03-09 12:13:19.490284+09,5,500,500,,/bin/bash,f,,,t,0,0,
5152,camaraaix73,resellerlogin@fra.pwdata.jp,"",CAMARA AIX LES BAINS 73,4797,"",1,1,2010-02-24 10:33:32.884101+09,7,500,500,,/bin/bash,f,,,t,0,0,
5147,phototech75,,phil,PHOTOTECH 75,4792,0145431610,1,1,2010-02-24 10:33:32.884101+09,7,500,500,,/bin/bash,f,Europe/Paris,,t,0,0,
6340,fotohoerl53,info@foto-hoerl.de,"",Foto Hörl Frankenberg,5729,"",1,1,2010-02-24 11:35:41.457249+09,6,500,500,,/bin/bash,f,,,t,0,0,
1219,flueck662,foto-flueck@t-online.de,"",Frau Müller,7524,02642-43373,1,1,2011-02-21 19:08:33.789804+09,6,500,500,,/bin/bash,f,,,t,0,0,
1581,winblad,winblad@live.dk,Thomas,Winblad,7867,26360676,1,1,2011-08-23 03:20:39.485804+09,9,500,500,,/bin/bash,f,,,t,0,0,
7150,herrmann533,photoporstkleve@t-online.de,"",Herr Herrmann,6469,"",1,1,2010-02-24 11:35:41.457249+09,6,500,500,,/bin/bash,f,,,t,0,1,1579602976
6617166,kji142621,6686@photo-wonder.com,Camera,Sato,12918,0286136686,1,1,2019-01-29 03:55:51.271035+09,4,500,500,,/bin/bash,f,,,t,0,0,
10277,dlatto,david@davidlatto.co.uk,David,Latto,11236,0113 264 7297,1,1,2013-02-27 18:36:19.741257+09,3,500,500,,/bin/bash,f,,,t,0,0,
6616278,RBMimaging90275,rmendoza5280@cox.net,Richard,Mendoza,12035,310-544-4044,1,1,2017-12-28 03:20:15.912295+09,1,500,500,,/bin/bash,f,,,t,0,0,
17,minami,minami@photowonder.co.jp,Yasuaki,Minami,,"",1,5,2008-09-29 15:16:28.709229+09,4,500,500,,/bin/bash,f,,,t,0,0,
10849,thylanebliss83,thylanebliss@gmail.com,BLISS,THYLANE,11775,0674749208,1,1,2015-06-22 19:05:57.05875+09,7,500,500,,/bin/bash,f,,,t,0,0,
9035,lifesaver_417208500069,kristabeck@iwct.org,Krista,If Walls Could Talk,10021,417-208-5000,1,1,2012-04-25 16:54:05.733595+09,1,500,500,,/bin/bash,f,America/Chicago,,t,0,0,
7100,dclode,,"",Denis Clode,6421,,1,1,2010-02-18 16:13:46.408581+09,10,500,500,,/bin/bash,f,,,t,0,0,
10,yuko,yuko@photo-wonder.com,Yuko,Amari,,"",0,5,2008-09-10 12:12:29.631109+09,1,500,500,,/bin/bash,f,,,t,0,0,
9911,alpine541,bcash@alpineinternet.com,Brian,Cash,10892,"",1,1,2012-06-21 08:41:31.248922+09,1,500,500,,/bin/bash,f,,,t,0,0,
775,stanley,printing@darlingtonphotoworld.co.uk,"",Michelle and Chris,7119,01325468246,1,1,2009-11-12 01:10:23.035669+09,3,500,500,,/bin/bash,f,Europe/London,,t,0,0,
533,omagh,info@magikmoments.co.uk,Derek,Breslin,3635,028 82252497,1,1,2009-10-31 13:57:40.659035+09,3,500,500,,/bin/bash,f,Europe/London,,t,0,0,
10309,asmith,azztech@hotmail.co.uk,Anthony,Smith,11266,0740 353 9371,1,1,2013-04-23 21:11:26.790189+09,3,500,500,,/bin/bash,f,,,t,0,0,
6617271,klicphoto85,klic.photographe@gmail.com,Karine,JEANNE,13016,06 46 48 44 11,1,1,2020-08-03 16:55:12.972534+09,7,500,500,,/bin/bash,f,,,t,0,0,
10310,APC1831,apctrinin@gmail.com,Trini,Rocha,11267,956-787-1831,1,1,2013-04-24 00:34:10.040189+09,1,500,500,,/bin/bash,f,,,t,0,0,
410,snappy098,goldersgreen@snappysnaps.co.uk,"",Miles,2047,"",1,1,2009-10-31 13:57:40.659035+09,3,500,500,,/bin/bash,f,,,t,0,0,
4315,RAPIDPHOTO,rapidphoto@gmail.com,"",RAPID PHOTO LAB,4075,"",1,1,2010-02-22 17:17:17.483527+09,8,500,500,,/bin/bash,f,,,t,0,0,
7137,michaelo,,"",Michael O Sullivan,6456,,1,1,2010-02-18 16:13:46.408581+09,10,500,500,,/bin/bash,f,,,t,0,0,
12,gavin,gavin@photo-wonder.com,Gavin,Hirst,,"",0,5,2008-09-17 15:51:00.197328+09,3,500,500,,/bin/bash,f,,,t,0,0,
23,park,kenny.latham@tescos.co.uk,Kenny,Latham,3899,"",0,1,2008-11-05 14:09:17.353671+09,3,500,500,,/bin/bash,f,,,t,0,0,
25,AP68,alan.mills@tesco.co.uk,Alan,Mills,3899,"",0,1,2008-11-05 14:14:37.614555+09,3,500,500,,/bin/bash,f,,,t,0,0,
8826,lifesaver_662563534233,mike@foxfireframing.com,Mike,Campbell,9812,662-563-5342,1,1,2012-04-25 16:53:59.608922+09,1,500,500,,/bin/bash,f,America/Chicago,,t,0,0,
926,ccs5600,christine@christinescrop.com,Christine Rae,Bishop,7262,"",1,1,2010-06-04 04:00:50.367833+09,1,500,500,,/bin/bash,f,,,t,0,0,
1775,changkaishuma,drhyme@163.com,"",drhyme,,13918459466,1,3,2011-12-12 16:56:58.709862+09,20,500,500,,/bin/bash,f,,,t,0,0,
20,sheliwen,sheliwen@photo-wonder.com,Liwen,She,,"",1,7,2008-11-05 09:52:51.806824+09,3,500,500,,/bin/bash,f,,,t,0,0,
7140,fitzgibbon,,"",Dick Fitzgibbon,6459,,1,1,2010-02-18 16:13:46.408581+09,10,500,500,,/bin/bash,f,,,t,0,0,
10329,LD4545,Lollapalooza Designs,Ralph,Menard,11285,770-599-4545,1,1,2013-05-15 01:19:48.618216+09,1,500,500,,/bin/bash,f,,,t,0,0,
34,mfarmer,mark.farmer@cewecolor.co.uk,Mark,Farmer,2492,"",0,1,2009-02-19 17:06:30.941172+09,3,500,500,,/bin/bash,f,,,t,0,0,
9,mark,mark@photo-wonder.com,Mark,Manion,,"",0,5,2008-09-04 15:09:52.366349+09,1,500,500,,/bin/bash,f,Asia/Tokyo,,t,0,0,
9912,fluid541,jordan@fluidwebstudio.com,Jordan,Boston,10893,"",1,1,2012-06-22 03:31:46.604068+09,1,500,500,,/bin/bash,f,,,t,0,0,
21,zhangping,zhangping@photo-wonder.com,Ping,Zhang,,"",1,7,2008-11-05 09:55:54.447013+09,3,500,500,,/bin/bash,f,,,t,0,0,
1945525,pillorget76,andre.pillorget@orange.fr,Andre,PILLORGET,11901,02 35 90 52 07,1,1,2016-05-19 17:13:12.332824+09,7,500,500,,/bin/bash,f,,,t,0,0,
1278,gregm,gregmuldowney@gmail.com,Greg,Muldowney,7580,"",1,1,2011-04-05 19:57:33.236655+09,10,500,500,,/bin/bash,f,,,t,0,0,
9913,柯达黄金广场店,1031673638@qq.com,柯达黄金广场店,柯达黄金广场店,10787,"",1,1,2012-06-22 20:16:10.694044+09,20,500,500,,/bin/bash,f,,,t,0,0,
9914,fzaidi,welcome2trio@yahoo.co.uk,Faiza,Zaidi,10894,0207 435 5003,1,1,2012-06-22 22:48:14.986192+09,3,500,500,,/bin/bash,f,,,t,0,0,
6627,bigwrestore,,"",BIG W Restoration,5948,,1,1,2009-04-15 11:07:19.154781+09,8,500,500,,/bin/bash,f,,,t,0,0,
6617213,Aiman,xxx@xxx,aiman,xxx,11318,"",1,1,2019-06-17 23:39:42.973066+09,3,500,500,,/bin/bash,f,,,t,0,0,
6615939,katiewaring,katie.waring@hotmail.com,Katie,Waring,11929,07727605608,1,1,2016-09-07 02:31:10.709087+09,3,500,500,,/bin/bash,f,,,t,0,0,
814,haria,harishlharia@gmail.com,Harish,Haria,7165,07803745961,1,1,2010-01-26 19:11:14.664192+09,3,500,500,,/bin/bash,f,,,t,0,1,1592206185
6659,BIGW125,,"",BIGW125,5961,,1,1,2009-04-15 11:07:19.154781+09,8,500,500,,/bin/bash,f,,,t,0,0,
6660,BIGW126,,"",BIGW126,5962,,1,1,2009-04-15 11:07:19.154781+09,8,500,500,,/bin/bash,f,,,t,0,0,
6661,BIGW127,,"",BIGW127,5963,,1,1,2009-04-15 11:07:19.154781+09,8,500,500,,/bin/bash,f,,,t,0,0,
6662,BIGW128,,"",BIGW128,5964,,1,1,2009-04-15 11:07:19.154781+09,8,500,500,,/bin/bash,f,,,t,0,0,
15,r.umurere,Rosene.Umurere@cewecolor.co.uk,Rosene,Umurere,2492,"",1,1,2008-09-24 17:21:42.193661+09,3,500,500,/home/soosdata/production/photos/FTP/CEWE,/bin/bash,f,,,t,0,0,
6655,BIGW121,121@bigw.com.au,"",BIGW121,5956,"",1,1,2009-04-15 11:07:19.154781+09,8,500,500,,/bin/bash,f,,,t,0,0,
6657,BIGW123,closed123,"",BIGW123,5959,"",1,1,2009-04-15 11:07:19.154781+09,8,500,500,,/bin/bash,f,,,t,0,0,
6663,BIGW129,closed129,"",BIGW129,5965,"",1,1,2009-04-15 11:07:19.154781+09,8,500,500,,/bin/bash,f,,,t,0,0,
6633,BIGW156,closde156,"",BIGW156,5953,"",1,1,2009-04-15 11:07:19.154781+09,8,500,500,,/bin/bash,f,,,t,0,0,
7226,kehr249,info@foto-kehr.de,Roland,Foto Roland Kehr Kieselbronn,6543,07231565782,1,1,2010-02-24 11:35:41.457249+09,6,500,500,,/bin/bash,f,Europe/Berlin,,t,0,0,
6665,BIGW132,,"",BIGW132,5967,,1,1,2009-04-15 11:07:19.154781+09,8,500,500,,/bin/bash,f,,,t,0,0,
6666,BIGW133,,"",BIGW133,5968,,1,1,2009-04-15 11:07:19.154781+09,8,500,500,,/bin/bash,f,,,t,0,0,
6668,BIGW135,,"",BIGW135,5970,,1,1,2009-04-15 11:07:19.154781+09,8,500,500,,/bin/bash,f,,,t,0,0,
6669,BIGW136,,"",BIGW136,5971,,1,1,2009-04-15 11:07:19.154781+09,8,500,500,,/bin/bash,f,,,t,0,0,
6670,BIGW137,,"",BIGW137,5972,,1,1,2009-04-15 11:07:19.154781+09,8,500,500,,/bin/bash,f,,,t,0,0,
6671,BIGW138,,"",BIGW138,5973,,1,1,2009-04-15 11:07:19.154781+09,8,500,500,,/bin/bash,f,,,t,0,0,
6673,BIGW140,,"",BIGW140,5975,,1,1,2009-04-15 11:07:19.154781+09,8,500,500,,/bin/bash,f,,,t,0,0,
6676,BIGW143,,"",BIGW143,5978,,1,1,2009-04-15 11:07:19.154781+09,8,500,500,,/bin/bash,f,,,t,0,0,
4653,deifel,info@foto-deifel.de,Barbara,Deifel Fotostudio,4348,08771 1010,1,1,2010-02-24 11:35:41.457249+09,6,500,500,,/bin/bash,f,Europe/Berlin,,t,0,0,
6677,BIGW144,,"",BIGW144,5979,,1,1,2009-04-15 11:07:19.154781+09,8,500,500,,/bin/bash,f,,,t,0,0,
6678,BIGW145,,"",BIGW145,5980,,1,1,2009-04-15 11:07:19.154781+09,8,500,500,,/bin/bash,f,,,t,0,0,
165,click-158,silkeborg@click.dk,Click,Silkeborg,6329,86804142,1,1,2009-06-16 17:32:04.984046+09,1,500,500,,/bin/bash,f,Europe/Copenhagen,,t,0,0,
6682,BIGW149,,"",BIGW149,5984,,1,1,2009-04-15 11:07:19.154781+09,8,500,500,,/bin/bash,f,,,t,0,0,
6686,BIGW154,,"",BIGW154,5988,,1,1,2009-04-15 11:07:19.154781+09,8,500,500,,/bin/bash,f,,,t,0,0,
6687,BIGW155,,"",BIGW155,5989,,1,1,2009-04-15 11:07:19.154781+09,8,500,500,,/bin/bash,f,,,t,0,0,
6689,BIGW157,,"",BIGW157,5990,,1,1,2009-04-15 11:07:19.154781+09,8,500,500,,/bin/bash,f,,,t,0,0,
6692,BIGW161,,"",BIGW161,5993,,1,1,2009-04-15 11:07:19.154781+09,8,500,500,,/bin/bash,f,,,t,0,0,
6695,BIGW172,,"",BIGW172,5996,,1,1,2009-04-15 11:07:19.154781+09,8,500,500,,/bin/bash,f,,,t,0,0,
6699,BIGW176,,"",BIGW176,6000,,1,1,2009-04-15 11:07:19.154781+09,8,500,500,,/bin/bash,f,,,t,0,0,
6706,BIGW184,,"",BIGW184,6006,,1,1,2009-04-15 11:07:19.154781+09,8,500,500,,/bin/bash,f,,,t,0,0,
6709,BIGW187,,"",BIGW187,6009,,1,1,2009-04-15 11:07:19.154781+09,8,500,500,,/bin/bash,f,,,t,0,0,
6710,BIGW188,,"",BIGW188,6010,,1,1,2009-04-15 11:07:19.154781+09,8,500,500,,/bin/bash,f,,,t,0,0,
6713,BIGW245,,"",BIGW245,6013,,1,1,2009-04-15 11:07:19.154781+09,8,500,500,,/bin/bash,f,,,t,0,0,
6714,BIGW246,,"",BIGW246,6014,,1,1,2009-04-15 11:07:19.154781+09,8,500,500,,/bin/bash,f,,,t,0,0,
6720,BIGW252,,"",BIGW252,6020,,1,1,2009-04-15 11:07:19.154781+09,8,500,500,,/bin/bash,f,,,t,0,0,
6721,BIGW253,,"",BIGW253,6021,,1,1,2009-04-15 11:07:19.154781+09,8,500,500,,/bin/bash,f,,,t,0,0,
6723,BIGW255,,"",BIGW255,6023,,1,1,2009-04-15 11:07:19.154781+09,8,500,500,,/bin/bash,f,,,t,0,0,
6664,BIGW130,closed130,"",BIGW130,5966,"",1,1,2009-04-15 11:07:19.154781+09,8,500,500,,/bin/bash,f,,,t,0,0,
6728,BIGW262,,"",BIGW262,6027,,1,1,2009-04-15 11:07:19.154781+09,8,500,500,,/bin/bash,f,,,t,0,0,
6730,BIGW264,,"",BIGW264,6029,,1,1,2009-04-15 11:07:19.154781+09,8,500,500,,/bin/bash,f,,,t,0,0,
6732,BIGW266,,"",BIGW266,6031,,1,1,2009-04-15 11:07:19.154781+09,8,500,500,,/bin/bash,f,,,t,0,0,
6734,BIGW269,,"",BIGW269,6033,,1,1,2009-04-15 11:07:19.154781+09,8,500,500,,/bin/bash,f,,,t,0,0,
6735,BIGW270,,"",BIGW270,6034,,1,1,2009-04-15 11:07:19.154781+09,8,500,500,,/bin/bash,f,,,t,0,0,
6667,BIGW134,closed134,"",BIGW134,5969,"",1,1,2009-04-15 11:07:19.154781+09,8,500,500,,/bin/bash,f,,,t,0,0,
6672,BIGW139,closed139,"",BIGW139,5974,"",1,1,2009-04-15 11:07:19.154781+09,8,500,500,,/bin/bash,f,,,t,0,0,
6674,BIGW141,closed141,"",BIGW141,5976,"",1,1,2009-04-15 11:07:19.154781+09,8,500,500,,/bin/bash,f,,,t,0,0,
6675,BIGW142,closed142,"",BIGW142,5977,"",1,1,2009-04-15 11:07:19.154781+09,8,500,500,,/bin/bash,f,,,t,0,0,
6679,BIGW146,closed146,"",BIGW146,5981,"",1,1,2009-04-15 11:07:19.154781+09,8,500,500,,/bin/bash,f,,,t,0,0,
6680,BIGW147,closed147,"",BIGW147,5982,"",1,1,2009-04-15 11:07:19.154781+09,8,500,500,,/bin/bash,f,,,t,0,0,
6681,BIGW148,closed148,"",BIGW148,5983,"",1,1,2009-04-15 11:07:19.154781+09,8,500,500,,/bin/bash,f,,,t,0,0,
6683,BIGW150,closed150,"",BIGW150,5985,"",1,1,2009-04-15 11:07:19.154781+09,8,500,500,,/bin/bash,f,,,t,0,0,
6685,BIGW153,closed153,"",BIGW153,5987,"",1,1,2009-04-15 11:07:19.154781+09,8,500,500,,/bin/bash,f,,,t,0,0,
6690,BIGW158,closed158,"",BIGW158,5991,"",1,1,2009-04-15 11:07:19.154781+09,8,500,500,,/bin/bash,f,,,t,0,0,
6691,BIGW159,closed159,"",BIGW159,5992,"",1,1,2009-04-15 11:07:19.154781+09,8,500,500,,/bin/bash,f,,,t,0,0,
6694,BIGW171,closed171,"",BIGW171,5995,"",1,1,2009-04-15 11:07:19.154781+09,8,500,500,,/bin/bash,f,,,t,0,0,
6696,BIGW173,closed173,"",BIGW173,5997,"",1,1,2009-04-15 11:07:19.154781+09,8,500,500,,/bin/bash,f,,,t,0,0,
6697,BIGW174,closed174,"",BIGW174,5998,"",1,1,2009-04-15 11:07:19.154781+09,8,500,500,,/bin/bash,f,,,t,0,0,
6698,BIGW175,closed175,"",BIGW175,5999,"",1,1,2009-04-15 11:07:19.154781+09,8,500,500,,/bin/bash,f,,,t,0,0,
6700,BIGW177,closed177,"",BIGW177,6001,"",1,1,2009-04-15 11:07:19.154781+09,8,500,500,,/bin/bash,f,,,t,0,0,
6702,BIGW178,closed178,"",BIGW178,6002,"",1,1,2009-04-15 11:07:19.154781+09,8,500,500,,/bin/bash,f,,,t,0,0,
6704,BIGW180,closed180,"",BIGW180,6004,"",1,1,2009-04-15 11:07:19.154781+09,8,500,500,,/bin/bash,f,,,t,0,0,
6705,BIGW181,closed181,"",BIGW181,6005,"",1,1,2009-04-15 11:07:19.154781+09,8,500,500,,/bin/bash,f,,,t,0,0,
6707,BIGW185,closed185,"",BIGW185,6007,"",1,1,2009-04-15 11:07:19.154781+09,8,500,500,,/bin/bash,f,,,t,0,0,
6708,BIGW186,closed186,"",BIGW186,6008,"",1,1,2009-04-15 11:07:19.154781+09,8,500,500,,/bin/bash,f,,,t,0,0,
6712,BIGW244,closed244,"",BIGW244,6012,"",1,1,2009-04-15 11:07:19.154781+09,8,500,500,,/bin/bash,f,,,t,0,0,
6715,BIGW247,closed247,"",BIGW247,6015,"",1,1,2009-04-15 11:07:19.154781+09,8,500,500,,/bin/bash,f,,,t,0,0,
6716,BIGW248,CLOSED248,"",BIGW248,6016,"",1,1,2009-04-15 11:07:19.154781+09,8,500,500,,/bin/bash,f,,,t,0,0,
6717,BIGW249,CLOSED249,"",BIGW249,6017,"",1,1,2009-04-15 11:07:19.154781+09,8,500,500,,/bin/bash,f,,,t,0,0,
6719,BIGW251,CLOSED251,"",BIGW251,6019,"",1,1,2009-04-15 11:07:19.154781+09,8,500,500,,/bin/bash,f,,,t,0,0,
6722,BIGW254,CLOSED254,"",BIGW254,6022,"",1,1,2009-04-15 11:07:19.154781+09,8,500,500,,/bin/bash,f,,,t,0,0,
6724,BIGW256,CLOSED256,"",BIGW256,6024,"",1,1,2009-04-15 11:07:19.154781+09,8,500,500,,/bin/bash,f,,,t,0,0,
6725,BIGW257,CLOSED257,"",BIGW257,6025,"",1,1,2009-04-15 11:07:19.154781+09,8,500,500,,/bin/bash,f,,,t,0,0,
6729,BIGW263,CLOSED263,"",BIGW263,6028,"",1,1,2009-04-15 11:07:19.154781+09,8,500,500,,/bin/bash,f,,,t,0,0,
6733,BIGW267,CLOSED267,"",BIGW267,6032,"",1,1,2009-04-15 11:07:19.154781+09,8,500,500,,/bin/bash,f,,,t,0,0,
275,PPMEMORIES,picperfect@internode.on.net,"",ANTONELLO,7066,0883654758,1,1,2009-08-11 10:51:29.016054+09,8,500,500,,/bin/bash,f,Australia/Adelaide,,t,0,0,
6738,BIGW274,,"",BIGW274,6037,,1,1,2009-04-15 11:07:19.154781+09,8,500,500,,/bin/bash,f,,,t,0,0,
31,qualityphotos,info@kodakexpresskilburn.com,Hanif,Kapadia,1838,+44207 624 1329,1,1,2009-02-05 18:38:02.458979+09,3,500,500,,/bin/bash,f,Europe/London,,t,0,1,1601887652
6743,BIGW279,,"",BIGW279,6041,,1,1,2009-04-15 11:07:19.154781+09,8,500,500,,/bin/bash,f,,,t,0,0,
6745,BIGW281,,"",BIGW281,6043,,1,1,2009-04-15 11:07:19.154781+09,8,500,500,,/bin/bash,f,,,t,0,0,
6752,BIGW289,,"",BIGW289,6049,,1,1,2009-04-15 11:07:19.154781+09,8,500,500,,/bin/bash,f,,,t,0,0,
6766,BIGW366,,"",BIGW366,6051,,1,1,2009-04-15 11:07:19.154781+09,8,500,500,,/bin/bash,f,,,t,0,0,
1625,cpidavid,dcoe@cpicorp.com,David,Coe,4452,"",1,1,2011-09-24 06:01:04.317968+09,1,500,500,,/bin/bash,f,,,t,0,0,
10345,laurabond,info@lauratherestorer.co.uk,Laura,Bond,11302,07818164996,1,1,2013-07-08 17:43:32.203605+09,3,500,500,,/bin/bash,f,,,t,0,0,
6773,BIGW376,,"",BIGW376,6060,,1,1,2009-04-15 11:07:19.154781+09,8,500,500,,/bin/bash,f,,,t,0,0,
6774,BIGW377,,"",BIGW377,6061,,1,1,2009-04-15 11:07:19.154781+09,8,500,500,,/bin/bash,f,,,t,0,0,
10494,epadmore,ed@vintagephotolab.com,Ed,Padmore,11444,0207 978 7502,1,1,2013-11-19 21:47:22.375329+09,3,500,500,,/bin/bash,f,,,t,0,0,
6778,BIGW381,,"",BIGW381,6065,,1,1,2009-04-15 11:07:19.154781+09,8,500,500,,/bin/bash,f,,,t,0,0,
1119,print,aamir@printexpress.co.uk,Aamir,Jiwa,7448,+44 208 181 4015,1,1,2010-11-04 23:16:47.415599+09,3,500,500,,/bin/bash,f,,,t,0,0,
6781,BIGW384,,"",BIGW384,6067,,1,1,2009-04-15 11:07:19.154781+09,8,500,500,,/bin/bash,f,,,t,0,0,
6787,BIGW388,,"",BIGW388,6071,,1,1,2009-04-15 11:07:19.154781+09,8,500,500,,/bin/bash,f,,,t,0,0,
6793,BIGW392,,"",BIGW392,6074,,1,1,2009-04-15 11:07:19.154781+09,8,500,500,,/bin/bash,f,,,t,0,0,
6794,BIGW393,,"",BIGW393,6075,,1,1,2009-04-15 11:07:19.154781+09,8,500,500,,/bin/bash,f,,,t,0,0,
6796,BIGW394,,"",BIGW394,6076,,1,1,2009-04-15 11:07:19.154781+09,8,500,500,,/bin/bash,f,,,t,0,0,
6799,BIGW397,,"",BIGW397,6078,,1,1,2009-04-15 11:07:19.154781+09,8,500,500,,/bin/bash,f,,,t,0,0,
6789,BIGW553,,"",BIGW553,6084,,1,1,2009-04-15 11:07:19.154781+09,8,500,500,,/bin/bash,f,,,t,0,0,
6792,BIGW555,,"",BIGW555,6086,,1,1,2009-04-15 11:07:19.154781+09,8,500,500,,/bin/bash,f,,,t,0,0,
6803,BIGW559,,"",BIGW559,6090,,1,1,2009-04-15 11:07:19.154781+09,8,500,500,,/bin/bash,f,,,t,0,0,
6805,BIGW564,,"",BIGW564,6092,,1,1,2009-04-15 11:07:19.154781+09,8,500,500,,/bin/bash,f,,,t,0,0,
6806,BIGW565,,"",BIGW565,6093,,1,1,2009-04-15 11:07:19.154781+09,8,500,500,,/bin/bash,f,,,t,0,0,
6810,BIGW447,,"",BIGW447,6097,,1,1,2009-04-15 11:07:19.154781+09,8,500,500,,/bin/bash,f,,,t,0,0,
6815,BIGW452,,"",BIGW452,6102,,1,1,2009-04-15 11:07:19.154781+09,8,500,500,,/bin/bash,f,,,t,0,0,
6816,BIGW453,,"",BIGW453,6103,,1,1,2009-04-15 11:07:19.154781+09,8,500,500,,/bin/bash,f,,,t,0,0,
6819,BIGW456,,"",BIGW456,6105,,1,1,2009-04-15 11:07:19.154781+09,8,500,500,,/bin/bash,f,,,t,0,0,
6737,BIGW272,CLOSED272,"",BIGW272,6036,"",1,1,2009-04-15 11:07:19.154781+09,8,500,500,,/bin/bash,f,,,t,0,0,
6739,BIGW275,CLOSED275,"",275,6038,"",1,1,2009-04-15 11:07:19.154781+09,8,500,500,,/bin/bash,f,,,t,0,0,
6740,BIGW276,CLOSED276,"",BIGW276,6039,"",1,1,2009-04-15 11:07:19.154781+09,8,500,500,,/bin/bash,f,,,t,0,0,
6741,BIGW277,CLOSED277,"",BIGW277,6040,"",1,1,2009-04-15 11:07:19.154781+09,8,500,500,,/bin/bash,f,,,t,0,0,
6744,BIGW280,CLOSED280,"",BIGW280,6042,"",1,1,2009-04-15 11:07:19.154781+09,8,500,500,,/bin/bash,f,,,t,0,0,
6746,BIGW282,CLOSED282,"",BIGW282,6044,"",1,1,2009-04-15 11:07:19.154781+09,8,500,500,,/bin/bash,f,,,t,0,0,
6748,BIGW283,CLOSED283,"",BIGW283,6045,"",1,1,2009-04-15 11:07:19.154781+09,8,500,500,,/bin/bash,f,,,t,0,0,
6749,BIGW284,CLOSED284,"",BIGW284,6046,"",1,1,2009-04-15 11:07:19.154781+09,8,500,500,,/bin/bash,f,,,t,0,0,
6750,BIGW285,CLOSED285,"",BIGW285,6047,"",1,1,2009-04-15 11:07:19.154781+09,8,500,500,,/bin/bash,f,,,t,0,0,
6765,BIGW371,closed371,"",BIGW371,6055,"",1,1,2009-04-15 11:07:19.154781+09,8,500,500,,/bin/bash,f,,,t,0,0,
6771,BIGW374,closed374,"",BIGW374,6058,"",1,1,2009-04-15 11:07:19.154781+09,8,500,500,,/bin/bash,f,,,t,0,0,
6772,BIGW375,closed375,"",BIGW375,6059,"",1,1,2009-04-15 11:07:19.154781+09,8,500,500,,/bin/bash,f,,,t,0,0,
6775,BIGW378,closed378,"",BIGW378,6062,"",1,1,2009-04-15 11:07:19.154781+09,8,500,500,,/bin/bash,f,,,t,0,0,
6776,BIGW379,closed379,"",BIGW379,6063,"",1,1,2009-04-15 11:07:19.154781+09,8,500,500,,/bin/bash,f,,,t,0,0,
6782,BIGW385,closed385,"",BIGW385,6068,"",1,1,2009-04-15 11:07:19.154781+09,8,500,500,,/bin/bash,f,,,t,0,0,
6784,BIGW386,closed386,"",BIGW386,6069,"",1,1,2009-04-15 11:07:19.154781+09,8,500,500,,/bin/bash,f,,,t,0,0,
6785,BIGW387,closed387,"",BIGW387,6070,"",1,1,2009-04-15 11:07:19.154781+09,8,500,500,,/bin/bash,f,,,t,0,0,
6797,BIGW396,closed396,"",BIGW396,6077,"",1,1,2009-04-15 11:07:19.154781+09,8,500,500,,/bin/bash,f,,,t,0,0,
6802,BIGW399,closed399,"",BIGW399,6080,"",1,1,2009-04-15 11:07:19.154781+09,8,500,500,,/bin/bash,f,,,t,0,0,
6807,BIGW441,closed441,"",BIGW441,6094,"",1,1,2009-04-15 11:07:19.154781+09,8,500,500,,/bin/bash,f,,,t,0,0,
6808,BIGW443,closed443,"",BIGW443,6095,"",1,1,2009-04-15 11:07:19.154781+09,8,500,500,,/bin/bash,f,,,t,0,0,
6809,BIGW444,closed444,"",BIGW444,6096,"",1,1,2009-04-15 11:07:19.154781+09,8,500,500,,/bin/bash,f,,,t,0,0,
6811,BIGW448,closed448,"",BIGW448,6098,"",1,1,2009-04-15 11:07:19.154781+09,8,500,500,,/bin/bash,f,,,t,0,0,
6812,BIGW449,closed449,"",BIGW449,6099,"",1,1,2009-04-15 11:07:19.154781+09,8,500,500,,/bin/bash,f,,,t,0,0,
6813,BIGW450,closed450,"",BIGW450,6100,"",1,1,2009-04-15 11:07:19.154781+09,8,500,500,,/bin/bash,f,,,t,0,0,
6814,BIGW451,closed451,"",BIGW451,6101,"",1,1,2009-04-15 11:07:19.154781+09,8,500,500,,/bin/bash,f,,,t,0,0,
6817,BIGW454,closed454,"",BIGW454,6104,"",1,1,2009-04-15 11:07:19.154781+09,8,500,500,,/bin/bash,f,,,t,0,0,
6780,BIGW550,closed550,"",BIGW550,6081,"",1,1,2009-04-15 11:07:19.154781+09,8,500,500,,/bin/bash,f,,,t,0,0,
6783,BIGW551,closed551,"",BIGW551,6082,"",1,1,2009-04-15 11:07:19.154781+09,8,500,500,,/bin/bash,f,,,t,0,0,
6786,BIGW552,closed552,"",BIGW552,6083,"",1,1,2009-04-15 11:07:19.154781+09,8,500,500,,/bin/bash,f,,,t,0,0,
6790,BIGW554,closed554,"",BIGW554,6085,"",1,1,2009-04-15 11:07:19.154781+09,8,500,500,,/bin/bash,f,,,t,0,0,
6795,BIGW556,closed556,"",BIGW556,6087,"",1,1,2009-04-15 11:07:19.154781+09,8,500,500,,/bin/bash,f,,,t,0,0,
6798,BIGW557,closed557,"",BIGW557,6088,"",1,1,2009-04-15 11:07:19.154781+09,8,500,500,,/bin/bash,f,,,t,0,0,
6800,BIGW558,closed558,"",BIGW558,6089,"",1,1,2009-04-15 11:07:19.154781+09,8,500,500,,/bin/bash,f,,,t,0,0,
6804,BIGW562,closed562,"",BIGW562,6091,"",1,1,2009-04-15 11:07:19.154781+09,8,500,500,,/bin/bash,f,,,t,0,0,
6727,BIGW260,,"",BIGW260,6124,,1,1,2009-04-15 11:07:19.154781+09,8,500,500,,/bin/bash,f,,,t,0,0,
10918,CAMERACORNERNORTHWEST,admin@cameracorner.co.nz,Camera,Corner,11835,09 416 0525,1,1,2015-11-20 14:52:58.85934+09,8,500,500,,/bin/bash,f,,,t,0,0,
205,AFFORDABLE,affordablephotos@bigpond.com,"",Teena,7003,"",1,1,2009-07-02 13:25:39.202715+09,8,500,500,,/bin/bash,f,,,t,0,0,
6135,fotowolf,info@foto-wolf.ch,"",Foto Wolf Chur,5549,"",1,1,2010-02-24 11:35:41.457249+09,6,500,500,,/bin/bash,f,,,t,0,0,
5486683,gcunningham,maj7@eircom.net,Greg,Cunningham,11922,00353 892465101,1,1,2016-07-27 20:22:31.948211+09,10,500,500,,/bin/bash,f,,,t,0,0,
10721,HNBLENHEIM,stella.seabra@nz.harveynorman.com,Stella,Seabra,11659,"",1,1,2014-11-07 10:15:51.682449+09,8,500,500,,/bin/bash,f,Pacific/Auckland,,t,0,1,1609186155
104,harrierasda,cpenny@harrierllc.co.uk,Harrier,(ASDA),6259,"",1,1,2009-05-19 11:08:49.516403+09,3,500,500,,/bin/bash,f,,,t,0,0,
1120,ryan,selectronic27@hotmail.co.uk,Ryan,Marshall,7449,01268 691481,1,1,2010-11-05 21:23:00.462526+09,3,500,500,,/bin/bash,f,,,t,0,0,
106,sainsburys,fuji@pwdata.jp,Sainsburys,(Fuji),6301,"",1,1,2009-06-01 21:48:56.169088+09,3,500,500,,/bin/bash,f,,,t,0,0,
208,ARTAGRAPH,colin@artagraph.biz,"",GORDON,7005,"",1,1,2009-07-03 10:40:30.878713+09,8,500,500,,/bin/bash,f,,,t,0,0,
37,PWCVSCS1,pwcvscs1@pwdata.jp,CVS,Support,5881,"",1,1,2009-03-17 16:34:33.699907+09,5,500,500,,/bin/bash,f,,,t,0,0,
1220,sophieleportrait66,resellerlogin210211 @fra.pwdata.jp,"",le portrait,7525,"",1,1,2011-02-22 18:02:58.742237+09,7,500,500,,/bin/bash,f,,,t,0,0,
216,kep8240,kisphoto@aol.com,Kenneth,Sutton,7012,508 990 8240,1,1,2009-07-11 05:03:18.982955+09,1,500,500,,/bin/bash,f,,,t,0,0,
1279,quaid,photo@quaidgallery.ie,Catherine,Quaid,7581,"",1,1,2011-04-05 20:25:03.896426+09,10,500,500,,/bin/bash,f,,,t,0,0,
222,pm7100,peter@photomarketmaine.com,Peter,Doe,7018,207 797 7100,1,1,2009-07-11 05:17:05.14003+09,1,500,500,,/bin/bash,f,,,t,0,0,
225,lcs3331,steve@leoscamerashop.com,Steve ,Spencer,7021,541 882 3331,1,1,2009-07-11 05:22:12.879551+09,1,500,500,,/bin/bash,f,,,t,0,0,
240,api4712,acephoto@sbcglobal.net,Nick,Situ,7036,916 482 4712,1,1,2009-07-11 07:16:40.349716+09,1,500,500,,/bin/bash,f,,,t,0,0,
243,sp1800,suddenfoto@aol.com,David ,Kim,7039,909 381 1800,1,1,2009-07-11 07:22:02.377525+09,1,500,500,,/bin/bash,f,,,t,0,0,
10317,DE0774,eastgate@digitaleye.co.za,Harry,Wertheim,11273,011-615-0774,1,1,2013-05-10 02:12:25.817772+09,1,500,500,,/bin/bash,f,,,t,0,0,
253,dp0409,bcros@yahoo.com,Brad,Crosby,6190,(740) 335-4440,1,1,2009-07-17 08:19:28.522921+09,1,500,500,,/bin/bash,f,,,t,0,0,
229,sp9877,laisammys@aol.com,Sam,Lai,7025,931 454 9877,1,1,2009-07-11 05:29:13.742161+09,1,500,500,,/bin/bash,f,,,t,0,0,
242,vp2004,vansmentor@store.com,Skip,Trombetti,5326,440 205-2004,1,1,2009-07-11 07:20:52.408924+09,1,500,500,,/bin/bash,f,,,t,0,0,
220,riggs1838,riggscam@midrivers.com,Jim & Pam,Riggs,7016,406 234 1838 ,1,1,2009-07-11 05:13:15.3646+09,1,500,500,,/bin/bash,f,America/Denver,,t,0,0,
156,jfyo-142,jm@jmfoto.dk,,,6320,8668 2828,1,1,2009-06-16 17:32:04.984046+09,1,500,500,,/bin/bash,f,,,t,0,0,